C++ Syntax Error Identifier

Is Psychology Today A Scholarly Source Date: November 8, 2018; Source: University of Pennsylvania; Summary: Facebook, Psychologist Melissa G. Hunt published her findings in the December. Aug 7, 2019. Article continues below. While those particular conditions are more prevalent in men, Psychology Today has stated that a commonly cited. The articles appearing in popular journals such

syntax error : missing ‘)’ before identifier ‘puiMsh_MsgMouseWheel’ c:program filesmicrosoft visual studio 8vcplatformsdkincludezmouse.h 142 6)Error 6 error C4430: missing type specifier – int.

how we can create an object pointer of _interface in C++. error C2501: ‘CRPCValidation::m_pRpcControlImpl’ : missing storage-class or type specifiers d:Odin_1ODIN_1OdinRPCvalidation.h(127) :.

Please help me run this program, i forgot the. Visual C++ 6.0 Well what are the errors? and can u please paste the code again. C:Documents and SettingsuserDesktopCPPtryUntitled1.cpp(29) :.

Hi guys, I’m trying to link a Micro-controller board to my C++. error C2228: left of ‘.SerialPort’ must have class/struct/union 1>.zebraDlg.cpp(1696) : error C2065: ‘mySerialPort’ : undeclared.

“taken Together, Help Enhance” + “dissertation” + “methods” Her dissertation research focuses on the pharmacokinetics and metabolism of nonsteroidal selective androgen receptor modulators and their potential application to osteoporosis. Professor of Pharmaceutics in the College of Pharmacy at The Ohio State mk-2866 ostarine examine University. Research Papers On Performance Appraisal System Hierarchical Structure Linguistics Different Meanings So they

The first error i get is at line 173: "typedef bool (*hgeCallback)();". I am not that good in C/C++ to understand what it means. hge.h(215) : error C2061: syntax error : identifier ‘hgeVertex’.

Apr 25, 2011. 1>c:usersmmddocumentsvisual studio 2010projects888888mynewheader.h( 6): error C2061: syntax error : identifier 'Form1'

I’m really new to C++, but not to programming. c:program filesmicrosoft visual studiovc98includewinnt.h(1094) : error C2146: syntax error : missing ‘;’ before identifier ‘KSPIN_LOCK’.

Undeclared identifier, e.g.: doy.cpp: In. Parse error, e.g.: somefile.cpp:24: parse error before `something'.

ifstream’ : undeclared identifier 1>c:usersjohndocumentscodec++testingc++testingc++testingc++.cpp(10): error C2146: syntax error : missing ‘;’ before identifier ‘my_file’.

Bug 464624 – C++ Parser fails with Syntax error on function declaration with. __ declspec keywords placed after * or & and in front of the variable identifier in a.

Home » C and C++ Compiler Errors and Warnings » List of the armcc error and warning messages. 12 : parsing restarts here after previous syntax error. 13 : expected. 92 : identifier-list parameters may only be used in a function definition.

Mar 4, 2018. The Digital Mars C and C++ compiler error messages in alphabetical. A syntax error exists in the base class initializer for the class identifier.

the compiler will flag the second one as an error. But C treats tags differently. C program to have both a tag and an another identifier with the same spelling in the same scope. The syntax for.

This documents some common C++ mistakes that beginning programmers make. These errors are. error C2146: syntax error : missing ';' before identifier 'cout'.

(course.h)error C2061: syntax error : identifier ‘Student’ (course.h)error C2143: syntax error : missing ‘;’ before ‘<‘ (course.h)error C4430: missing type specifier – int assumed. Note: C++ does not.

Jun 18, 2019. Unable to read Data using PyTorch C++ API (MNIST) · C++ · peterjc123 (Pu. 68 Error C2061 syntax error: identifier 'WeakIValue' example.

Jun 1, 2010. 1>network.cpp 1>c:fileswpdpack_4_1_1wpdpackincludepcapbpf.h(68) : error C2146: syntax error : missing ';' before identifier 'bpf_u_int32'.

I am facing one problem in visual c++. finalpro.cpp(129) : error C3861: ‘setprecision’: identifier not found 1>c:tcwin45binfinalpro.cpp(131) : error C2065: ‘ofstream’ : undeclared identifier 1>c.

1>c:userswilldocumentsvisual studio 2010projectsticticai.h(9): error C2061: syntax error : identifier ‘string’ 1>ai.cpp(11. I never didn’t trust you, I am new to C++ after all. One of you.

Note: C++ does not support default-int c:documents and settingstommy documentsvisual studio 2008projectsengineenginetimer.h(11) : error C2061: syntax error : identifier ‘clock_t’ c:documents.

Technique De Dissertation Pdf Les épreuves écrites les plus répandues sont la dissertation de culture générale, la dissertation juridique, la note. plus techniques et de langues. Pour chaque. Gradiometry was thus able to add essential detail to the features identified from LiDAR data. While the technique was not successful at identifying internal structures, it

i have a empty c++ win32 console program Peter.cpp and a window form John.h added. a error of " error C2061: syntax error : identifier ‘John’ " just comes out due to the code " Application::Run(new.

Note: C++ does not support default-int 1>g:computationc++cfdflowingheatflowingheatequation.h(65) : error C2061: syntax error : identifier ‘Simulation’.

1>Stack.c 1>c:usersmertdocumentsvisual studio 2008projectsmanual stack implementationmanual stack implementationstack.h(10) : error C2061: syntax error : identifier ‘Stack. compiling as C.

In this case, the specific error messages reveal that you are attempting to run your own C++ source code file. That will never work. You need to.

game.h(20): error C2146: syntax error : missing ‘;’ before identifier ‘adv’ game.h(20): error C4430: missing type specifier – int assumed. Note: C++ does not support default-int game.h(33): error.

syntax error : missing ‘;’ before identifier ‘years’ D:ADOBEVC++6PROJECTSaccessingmemberdataonheapmemdthp.cpp(36) : error C2017: illegal escape sequence.

My teacher asked me to submit the code in c++ so she can run it on her mac and. visual studio 10.0vcincludexutility 373 1 hw9_2_cpp Error 5 error C2146: syntax error : missing ‘;’ before.